BDBM50005360 4-(4-Methoxy-phenyl)-5-oxo-tetrahydro-furan-2-ylmethyl-ammonium; chloride::CHEMBL353221
SMILES COc1ccc(cc1)[C@H]1C[C@@H](C[NH3+])OC1=O
InChI Key InChIKey=ZQPKBRYJALEZGX-WDEREUQCSA-O
Data  1 KI
  Tab Delimited (TSV)   2D SDfile   Computed 3D by Vconf -m prep SDfile
Find this compound or compounds like it in BindingDB:
Activity Spreadsheet -- Enzyme Inhibition Constant Data from BindingDB
Found 1 hit for monomerid = 50005360
TargetAmine oxidase [flavin-containing] B(Bos taurus)
Northwestern University
Curated by ChEMBL
LigandPNGBDBM50005360(4-(4-Methoxy-phenyl)-5-oxo-tetrahydro-furan-2-ylme...)
Affinity DataKi:  6.67E+6nM. Assay description: Inhibitory constant against beef liver mitochondrial monoamine oxidase-B (MAO-B)
In DepthDetails ArticlePubMed