BDBM50005436 4-{2-Allylsulfanyl-2-[2-(morpholine-4-sulfonylamino)-3-phenyl-propionylamino]-acetylamino}-5-cyclohexyl-3-hydroxy-pentanoic acid (2-morpholin-4-yl-ethyl)-amide::CHEMBL8896
SMILES O[C@@H](CC(=O)NCCN1CCOCC1)[C@H](CC1CCCCC1)NC(=O)C(NC(=O)[C@H](Cc1ccccc1)NS(=O)(=O)N1CCOCC1)SCC=C
InChI Key InChIKey=DORMUSOHCBZVOD-CNUSUHBYSA-N
Data  2 IC50
  Tab Delimited (TSV)   2D SDfile   Computed 3D by Vconf -m prep SDfile
Find this compound or compounds like it in BindingDB:
Activity Spreadsheet -- Enzyme Inhibition Constant Data from BindingDB
Found 2 hits for monomerid = 50005436
TargetCathepsin D(Bos taurus)
Warner-Lambert
Curated by ChEMBL
LigandPNGBDBM50005436(4-{2-Allylsulfanyl-2-[2-(morpholine-4-sulfonylamin...)
Affinity DataIC50:  10nM. Assay description: Inhibitory activity against bovine cathepsin D
In DepthDetails ArticlePubMed
TargetRenin(Homo sapiens (Human))
Warner-Lambert
Curated by ChEMBL
LigandPNGBDBM50005436(4-{2-Allylsulfanyl-2-[2-(morpholine-4-sulfonylamin...)
Affinity DataIC50:  1.5nM. Assay description: Inhibitory activity against monkey renin in vitro.
In DepthDetails ArticlePubMed