BDBM50005457 1-(4-Chloro-phenyl)-3-(4,4-diphenyl-but-3-enyl)-urea::CHEMBL9538
SMILES Clc1ccc(-[#7]-[#6](=O)-[#7]-[#6]-[#6]\[#6]=[#6](\c2ccccc2)-c2ccccc2)cc1
InChI Key InChIKey=ZEZKSIBMWUDKPC-UHFFFAOYSA-N
Data  1 KI
  Tab Delimited (TSV)   2D SDfile   Computed 3D by Vconf -m prep SDfile
Find this compound or compounds like it in BindingDB:
Activity Spreadsheet -- Enzyme Inhibition Constant Data from BindingDB
Found 1 hit for monomerid = 50005457
TargetCholecystokinin receptor type A(RAT)
Center For Bio-Pharmaceutical Sciences
Curated by ChEMBL
LigandPNGBDBM50005457(1-(4-Chloro-phenyl)-3-(4,4-diphenyl-but-3-enyl)-ur...)
Affinity DataKi:  400nM. Assay description: Displacement of [3H]-L-364,718 from Cholecystokinin type A receptor of rat pancreatic membranes
In DepthDetails ArticlePubMed