BDBM50005469 1-(3,3-Diphenyl-allyl)-3-m-tolyl-urea::CHEMBL9312
SMILES [#6]-c1cccc(-[#7]-[#6](=O)-[#7]-[#6]\[#6]=[#6](\c2ccccc2)-c2ccccc2)c1
InChI Key InChIKey=AQCRRYHNTDGOLK-UHFFFAOYSA-N
Data  1 KI
  Tab Delimited (TSV)   2D SDfile   Computed 3D by Vconf -m prep SDfile
Find this compound or compounds like it in BindingDB:
Activity Spreadsheet -- Enzyme Inhibition Constant Data from BindingDB
Found 1 hit for monomerid = 50005469
TargetCholecystokinin receptor type A(RAT)
Center For Bio-Pharmaceutical Sciences
Curated by ChEMBL
LigandPNGBDBM50005469(1-(3,3-Diphenyl-allyl)-3-m-tolyl-urea | CHEMBL9312)
Affinity DataKi:  800nM. Assay description: Inhibition of [3H]-L-364,718 binding to cholecystokinin type A receptor in rat pancreas membranes
In DepthDetails ArticlePubMed