BDBM50005629 CHEMBL3235049
SMILES CCCCOc1cc(OCCCN(CC)CC)ccc1NC(=O)c1cc(nn1C)-c1ccc(OC2CCCCC2)cc1
InChI Key InChIKey=LRXMTNCXDHTHJA-UHFFFAOYSA-N
Data  1 IC50
  Tab Delimited (TSV)   2D SDfile   Computed 3D by Vconf -m prep SDfile
Find this compound or compounds like it in BindingDB:
Activity Spreadsheet -- Enzyme Inhibition Constant Data from BindingDB
Found 1 hit for monomerid = 50005629
TargetAdvanced glycosylation end product-specific receptor(Homo sapiens (Human))
Woosuk University
Curated by ChEMBL
LigandPNGBDBM50005629(CHEMBL3235049)
Affinity DataIC50:  2.50E+3nM. Assay description: Inhibition of biotinylated human RAGE assessed as bound amyloid beta level after 60 mins by ELISA
In DepthDetails ArticlePubMed