BDBM50005645 CHEMBL3235418
SMILES COC(=O)[C@H](Cc1c[nH]cn1)NC(=O)CN(CC(O)=O)C(=O)c1ccccc1
InChI Key InChIKey=IHZXQORULBBLAE-AWEZNQCLSA-N
Data  1 IC50
  Tab Delimited (TSV)   2D SDfile   Computed 3D by Vconf -m prep SDfile
Find this compound or compounds like it in BindingDB:
Activity Spreadsheet -- Enzyme Inhibition Constant Data from BindingDB
Found 1 hit for monomerid = 50005645
TargetInsulin-degrading enzyme(Homo sapiens (Human))
University Of Lille
Curated by ChEMBL
LigandPNGBDBM50005645(CHEMBL3235418)
Affinity DataIC50: >1.00E+5nM. Assay description: Inhibition of human recombinant IDE-mediated amyloid beta (16 to 23) hydrolysis using ATTO 655-Cys-Lys-Leu-Val-Phe-Phe-Ala-Glu-Asp-Trp as substrate p...
In DepthDetails ArticlePubMed