BDBM50005694 CHEMBL334985::N*1*-[1-Benzyl-3-(2-tert-butylcarbamoyl-pyrrolidin-1-yl)-2-hydroxy-3-oxo-propyl]-2-[2-(naphthalen-2-yloxy)-acetylamino]-succinamide
SMILES CC(C)(C)NC(=O)[C@@H]1CCCN1C(=O)[C@@H](O)[C@H](Cc1ccccc1)NC(=O)[C@H](CC(N)=O)NC(=O)COc1ccc2ccccc2c1
InChI Key InChIKey=AEOKJTYSPBJKOJ-KFZSMJGVSA-N
Data  2 IC50
  Tab Delimited (TSV)   2D SDfile   Computed 3D by Vconf -m prep SDfile
Find this compound or compounds like it in BindingDB:
Activity Spreadsheet -- Enzyme Inhibition Constant Data from BindingDB
Found 2 hits for monomerid = 50005694
TargetGag-Pol polyprotein [489-587](Human immunodeficiency virus type 1)
Washington University
Curated by ChEMBL
LigandPNGBDBM50005694(CHEMBL334985 | N*1*-[1-Benzyl-3-(2-tert-butylcarba...)
Affinity DataIC50:  1.30nM. Assay description: Inhibitory potency against HIV-1 protease
In DepthDetails ArticlePubMed
TargetGag-Pol polyprotein [489-587](Human immunodeficiency virus type 1)
Washington University
Curated by ChEMBL
LigandPNGBDBM50005694(CHEMBL334985 | N*1*-[1-Benzyl-3-(2-tert-butylcarba...)
Affinity DataIC50:  1.30nM. Assay description: Inhibitory activity of the Compound was tested against HIV protease enzyme.
In DepthDetails ArticlePubMed