BDBM50005831 2-(Adamantan-2-yloxycarbonylamino)-3-(1H-indol-3-yl)-2-methyl-propionic acid phenethyl ester::CHEMBL35580
SMILES CC(Cc1c[nH]c2ccccc12)(NC(=O)OC1[C@H]2C[C@@H]3C[C@@H](C[C@H]1C3)C2)C(=O)OCCc1ccccc1
InChI Key InChIKey=JTZTWVQPZYUTFD-QYEPPTMMSA-N
Data  2 IC50
  Tab Delimited (TSV)   2D SDfile   Computed 3D by Vconf -m prep SDfile
Find this compound or compounds like it in BindingDB:
Activity Spreadsheet -- Enzyme Inhibition Constant Data from BindingDB
Found 2 hits for monomerid = 50005831
TargetGastrin/cholecystokinin type B receptor(MOUSE)
Parke-Davis Neuroscience Research Center
Curated by ChEMBL
LigandPNGBDBM50005831(2-(Adamantan-2-yloxycarbonylamino)-3-(1H-indol-3-y...)
Affinity DataIC50:  1.07E+3nM. Assay description: Inhibition of [125I]CCK-8 binding to cholecystokinin type B receptor in the mouse cerebral cortex
In DepthDetails ArticlePubMed
TargetCholecystokinin receptor type A(RAT)
Parke-Davis Neuroscience Research Center
Curated by ChEMBL
LigandPNGBDBM50005831(2-(Adamantan-2-yloxycarbonylamino)-3-(1H-indol-3-y...)
Affinity DataIC50:  547nM. Assay description: Inhibition of [125I]CCK-8 binding to Cholecystokinin type A receptor in the rat pancreas
In DepthDetails ArticlePubMed