BDBM50005867 2-{4-[(2-Amino-4-oxo-3,4-dihydro-pyrido[2,3-d]pyrimidin-6-ylmethyl)-amino]-benzoylamino}-4-phosphono-butyric acid::CHEMBL40850
SMILES Nc1nc2ncc(CNc3ccc(cc3)C(=O)NC(CCP(O)(O)=O)C(O)=O)cc2c(=O)[nH]1
InChI Key InChIKey=OIGOTHHCNXEMSX-UHFFFAOYSA-N
Data  1 KI  2 IC50
  Tab Delimited (TSV)   2D SDfile   Computed 3D by Vconf -m prep SDfile
Find this compound or compounds like it in BindingDB:
Activity Spreadsheet -- Enzyme Inhibition Constant Data from BindingDB
Found 3 hits for monomerid = 50005867
TargetFolylpolyglutamate synthase, mitochondrial(Mus musculus)
Harvard Medical School
Curated by ChEMBL
LigandPNGBDBM50005867(2-{4-[(2-Amino-4-oxo-3,4-dihydro-pyrido[2,3-d]pyri...)
Affinity DataKi:  9.00E+3nM. Assay description: In vitro inhibition of mouse liver Folyl-polyglutamate synthase
In DepthDetails ArticlePubMed
TargetThymidylate synthase(Homo sapiens (Human))
Harvard Medical School
Curated by ChEMBL
LigandPNGBDBM50005867(2-{4-[(2-Amino-4-oxo-3,4-dihydro-pyrido[2,3-d]pyri...)
Affinity DataIC50:  3.00E+5nM. Assay description: In vitro inhibition of human thymidylate synthase (TS)
In DepthDetails ArticlePubMed
TargetDihydrofolate reductase(Homo sapiens (Human))
Harvard Medical School
Curated by ChEMBL
LigandPNGBDBM50005867(2-{4-[(2-Amino-4-oxo-3,4-dihydro-pyrido[2,3-d]pyri...)
Affinity DataIC50:  4.70E+3nM. Assay description: In vitro inhibition of human dihydrofolate reductase (DHFR)
In DepthDetails ArticlePubMed