BDBM50005938 2-Ethyl-tetradecanoic acid (2,4,6-trimethoxy-phenyl)-amide::CHEMBL295831
SMILES CCCCCCCCCCCCC(CC)C(=O)Nc1c(OC)cc(OC)cc1OC
InChI Key InChIKey=CQGWDLIWBJTOAO-UHFFFAOYSA-N
Data  1 IC50
  Tab Delimited (TSV)   2D SDfile   Computed 3D by Vconf -m prep SDfile
Find this compound or compounds like it in BindingDB:
Activity Spreadsheet -- Enzyme Inhibition Constant Data from BindingDB
Found 1 hit for monomerid = 50005938
TargetAcyl-CoA:cholesterol acyltransferase(Oryctolagus cuniculus)
Warner-Lambert
Curated by ChEMBL
LigandPNGBDBM50005938(2-Ethyl-tetradecanoic acid (2,4,6-trimethoxy-pheny...)
Affinity DataIC50:  52nM. Assay description: In vitro inhibition of acyl coenzyme A:cholesterol acyltransferase, in intestinal microsomes isolated from cholesterol-fed rabbits
In DepthDetails ArticlePubMed