BDBM50005961 CHEMBL417517::Octadec-9-enoic acid (2,6-diethyl-phenyl)-amide
SMILES CCCCCCCC\C=C\CCCCCCCC(=O)Nc1c(CC)cccc1CC
InChI Key InChIKey=RNRHGLUMOKYNIA-BUHFOSPRSA-N
Data  1 IC50
  Tab Delimited (TSV)   2D SDfile   Computed 3D by Vconf -m prep SDfile
Find this compound or compounds like it in BindingDB:
Activity Spreadsheet -- Enzyme Inhibition Constant Data from BindingDB
Found 1 hit for monomerid = 50005961
TargetAcyl-CoA:cholesterol acyltransferase(Oryctolagus cuniculus)
Warner-Lambert
Curated by ChEMBL
LigandPNGBDBM50005961(CHEMBL417517 | Octadec-9-enoic acid (2,6-diethyl-p...)
Affinity DataIC50:  17nM. Assay description: In vitro inhibition of acyl coenzyme A:cholesterol acyltransferase, in intestinal microsomes isolated from cholesterol-fed rabbits
In DepthDetails ArticlePubMed