BDBM50005984 2,2-Dimethyl-dodecanoic acid (2,4,6-trifluoro-phenyl)-amide::CHEMBL298330
SMILES CCCCCCCCCCC(C)(C)C(=O)Nc1c(F)cc(F)cc1F
InChI Key InChIKey=SGUDXPRVXINQKR-UHFFFAOYSA-N
Data  1 IC50
  Tab Delimited (TSV)   2D SDfile   Computed 3D by Vconf -m prep SDfile
Find this compound or compounds like it in BindingDB:
Activity Spreadsheet -- Enzyme Inhibition Constant Data from BindingDB
Found 1 hit for monomerid = 50005984
TargetAcyl-CoA:cholesterol acyltransferase(Oryctolagus cuniculus)
Warner-Lambert
Curated by ChEMBL
LigandPNGBDBM50005984(2,2-Dimethyl-dodecanoic acid (2,4,6-trifluoro-phen...)
Affinity DataIC50:  260nM. Assay description: In vitro inhibition of acyl coenzyme A:cholesterol acyltransferase, in intestinal microsomes isolated from cholesterol-fed rabbits
In DepthDetails ArticlePubMed