BDBM50006011 3-{3-[(3-Dodecyloxy-2-methoxy-phenoxy)-hydroxy-phosphoryloxy]-benzyl}-thiazol-3-ium::CHEMBL297458
SMILES CCCCCCCCCCCCOc1cccc(OP([O-])(=O)Oc2cccc(C[n+]3ccsc3)c2)c1OC
InChI Key InChIKey=PVDUMMLIGCVGHS-UHFFFAOYSA-N
Data  1 IC50
  Tab Delimited (TSV)   2D SDfile   Computed 3D by Vconf -m prep SDfile
Find this compound or compounds like it in BindingDB:
Activity Spreadsheet -- Enzyme Inhibition Constant Data from BindingDB
Found 1 hit for monomerid = 50006011
TargetPlatelet-activating factor receptor(Cavia porcellus)
American Cyanamid
Curated by ChEMBL
LigandPNGBDBM50006011(3-{3-[(3-Dodecyloxy-2-methoxy-phenoxy)-hydroxy-pho...)
Affinity DataIC50:  1.72E+4nM. Assay description: Inhibition of PAF induced platelet aggregation in rabbit
In DepthDetails ArticlePubMed