BDBM50006027 3-{3-[(3-Chloro-phenoxy)-hydroxy-phosphoryloxy]-benzyl}-thiazol-3-ium::CHEMBL47069
SMILES [O-]P(=O)(Oc1cccc(Cl)c1)Oc1cccc(C[n+]2ccsc2)c1
InChI Key InChIKey=XJAXASBRFWPUMG-UHFFFAOYSA-N
Data  1 IC50
  Tab Delimited (TSV)   2D SDfile   Computed 3D by Vconf -m prep SDfile
Find this compound or compounds like it in BindingDB:
Activity Spreadsheet -- Enzyme Inhibition Constant Data from BindingDB
Found 1 hit for monomerid = 50006027
TargetPlatelet-activating factor receptor(Cavia porcellus)
American Cyanamid
Curated by ChEMBL
LigandPNGBDBM50006027(3-{3-[(3-Chloro-phenoxy)-hydroxy-phosphoryloxy]-be...)
Affinity DataIC50:  2.20E+4nM. Assay description: Inhibition of PAF induced platelet aggregation in rabbit
In DepthDetails ArticlePubMed