BDBM50006037 3-(3-{[3-(4-Hexadecyloxy-phenoxy)-2-methoxy-propoxy]-hydroxy-phosphoryloxy}-benzyl)-thiazol-3-ium::CHEMBL46616
SMILES CCCCCCCCCCCCCCCCOc1ccc(OCC(COP([O-])(=O)Oc2cccc(C[n+]3ccsc3)c2)OC)cc1
InChI Key InChIKey=NVBVXIKTDHXKFQ-UHFFFAOYSA-N
Data  1 IC50
  Tab Delimited (TSV)   2D SDfile   Computed 3D by Vconf -m prep SDfile
Find this compound or compounds like it in BindingDB:
Activity Spreadsheet -- Enzyme Inhibition Constant Data from BindingDB
Found 1 hit for monomerid = 50006037
TargetPlatelet-activating factor receptor(Cavia porcellus)
American Cyanamid
Curated by ChEMBL
LigandPNGBDBM50006037(3-(3-{[3-(4-Hexadecyloxy-phenoxy)-2-methoxy-propox...)
Affinity DataIC50:  5.20E+3nM. Assay description: Inhibition of PAF induced platelet aggregation in rabbit
In DepthDetails ArticlePubMed