BDBM50006040 3-(3-{[3-(3-Dodecyloxy-2-methyl-phenoxy)-2-methoxy-propoxy]-hydroxy-phosphoryloxy}-benzyl)-thiazol-3-ium::CHEMBL297988
SMILES CCCCCCCCCCCCOc1cccc(OCC(COP([O-])(=O)Oc2cccc(C[n+]3ccsc3)c2)OC)c1C
InChI Key InChIKey=HXQFGAXHPKQTCN-UHFFFAOYSA-N
Data  1 IC50
  Tab Delimited (TSV)   2D SDfile   Computed 3D by Vconf -m prep SDfile
Find this compound or compounds like it in BindingDB:
Activity Spreadsheet -- Enzyme Inhibition Constant Data from BindingDB
Found 1 hit for monomerid = 50006040
TargetPlatelet-activating factor receptor(Cavia porcellus)
American Cyanamid
Curated by ChEMBL
LigandPNGBDBM50006040(3-(3-{[3-(3-Dodecyloxy-2-methyl-phenoxy)-2-methoxy...)
Affinity DataIC50:  2.89E+3nM. Assay description: Inhibition of PAF induced platelet aggregation in rabbit
In DepthDetails ArticlePubMed