BDBM50006074 3-{3-[(2,5-Dichloro-4-tetradecyloxy-phenoxy)-hydroxy-phosphoryloxy]-benzyl}-5-methyl-thiazol-3-ium::CHEMBL297182
SMILES CCCCCCCCCCCCCCOc1cc(Cl)c(OP([O-])(=O)Oc2cccc(C[n+]3csc(C)c3)c2)cc1Cl
InChI Key InChIKey=DVBVFTHSGNRRGL-UHFFFAOYSA-N
Data  1 IC50
  Tab Delimited (TSV)   2D SDfile   Computed 3D by Vconf -m prep SDfile
Find this compound or compounds like it in BindingDB:
Activity Spreadsheet -- Enzyme Inhibition Constant Data from BindingDB
Found 1 hit for monomerid = 50006074
TargetPlatelet-activating factor receptor(Cavia porcellus)
American Cyanamid
Curated by ChEMBL
LigandPNGBDBM50006074(3-{3-[(2,5-Dichloro-4-tetradecyloxy-phenoxy)-hydro...)
Affinity DataIC50:  560nM. Assay description: Inhibition of PAF induced platelet aggregation in rabbit
In DepthDetails ArticlePubMed