BDBM50006100 3-{3-[(3-Hexadecyloxy-2-methoxy-propoxy)-hydroxy-phosphoryloxy]-benzyl}-4-methyl-thiazol-3-ium::CHEMBL47167
SMILES CCCCCCCCCCCCCCCCOCC(COP([O-])(=O)Oc1cccc(C[n+]2cscc2C)c1)OC
InChI Key InChIKey=OWLZBYICNZOQLV-UHFFFAOYSA-N
Data  1 IC50
  Tab Delimited (TSV)   2D SDfile   Computed 3D by Vconf -m prep SDfile
Find this compound or compounds like it in BindingDB:
Activity Spreadsheet -- Enzyme Inhibition Constant Data from BindingDB
Found 1 hit for monomerid = 50006100
TargetPlatelet-activating factor receptor(Cavia porcellus)
American Cyanamid
Curated by ChEMBL
LigandPNGBDBM50006100(3-{3-[(3-Hexadecyloxy-2-methoxy-propoxy)-hydroxy-p...)
Affinity DataIC50:  6.67E+3nM. Assay description: Inhibition of PAF induced platelet aggregation in rabbit
In DepthDetails ArticlePubMed