BDBM50006101 Phosphoric acid 3-(1,3-dimethyl-thioureidomethyl)-phenyl ester 3-hexadecyloxy-2-methoxy-propyl ester
SMILES CCCCCCCCCCCCCCCCOCC(COP([O-])(=O)Oc1cccc(CN(C)C(=S)NC)c1)OC
InChI Key InChIKey=BKVKNCLEONYSIM-UHFFFAOYSA-M
Data  1 IC50
  Tab Delimited (TSV)   2D SDfile   Computed 3D by Vconf -m prep SDfile
Find this compound or compounds like it in BindingDB:
Activity Spreadsheet -- Enzyme Inhibition Constant Data from BindingDB
Found 1 hit for monomerid = 50006101
TargetPlatelet-activating factor receptor(Cavia porcellus)
American Cyanamid
Curated by ChEMBL
LigandPNGBDBM50006101(Phosphoric acid 3-(1,3-dimethyl-thioureidomethyl)-...)
Affinity DataIC50:  1.57E+4nM. Assay description: Inhibition of PAF induced platelet aggregation in rabbit
In DepthDetails ArticlePubMed