BDBM50006159 2-(1-Benzyl-2-morpholin-4-yl-2-oxo-ethoxy)-hexanoic acid (1-cyclohexylmethyl-2,3-dihydroxy-5-methyl-hexyl)-amide::CHEMBL430959
SMILES CCCC[C@H](O[C@@H](Cc1ccccc1)C(=O)N1CCOCC1)C(=O)N[C@@H](CC1CCCCC1)[C@@H](O)[C@@H](O)CC(C)C
InChI Key InChIKey=SKPVDDCIGPTRMX-STVCLKQXSA-N
Data  2 IC50
  Tab Delimited (TSV)   2D SDfile   Computed 3D by Vconf -m prep SDfile
Find this compound or compounds like it in BindingDB:
Activity Spreadsheet -- Enzyme Inhibition Constant Data from BindingDB
Found 2 hits for monomerid = 50006159
TargetRenin(Homo sapiens (Human))
Abbott Laboratories
Curated by ChEMBL
LigandPNGBDBM50006159(2-(1-Benzyl-2-morpholin-4-yl-2-oxo-ethoxy)-hexanoi...)
Affinity DataIC50:  1.00E+3nMpH: 7.4Assay Description:In vitro potency against purified renin at a pH of 6.0.
In DepthDetails ArticlePubMed
TargetRenin(Homo sapiens (Human))
Abbott Laboratories
Curated by ChEMBL
LigandPNGBDBM50006159(2-(1-Benzyl-2-morpholin-4-yl-2-oxo-ethoxy)-hexanoi...)
Affinity DataIC50:  15nMpH: 7.4Assay Description:In vitro potency against purified renin at a pH of 6.0.
In DepthDetails ArticlePubMed