BDBM50006175 CHEMBL299612::{4-[2-(2-tert-Butoxycarbonylamino-3-phenyl-propionylamino)-3-(1H-imidazol-4-yl)-propionylamino]-5-cyclohexyl-3-hydroxy-1-isopropyl-pentyl}-carbamic acid benzyl ester
SMILES CC(C)[C@H](C[C@H](O)[C@H](CC1CCCCC1)NC(=O)[C@H](Cc1cnc[nH]1)NC(=O)[C@H](Cc1ccccc1)NC(=O)OC(C)(C)C)NC(=O)OCc1ccccc1
InChI Key InChIKey=JHHSARVJZDXJAW-LTLCPEALSA-N
Data  1 IC50
  Tab Delimited (TSV)   2D SDfile   Computed 3D by Vconf -m prep SDfile
Find this compound or compounds like it in BindingDB:
Activity Spreadsheet -- Enzyme Inhibition Constant Data from BindingDB
Found 1 hit for monomerid = 50006175
TargetRenin(Homo sapiens (Human))
Abbott Laboratories
Curated by ChEMBL
LigandPNGBDBM50006175(CHEMBL299612 | {4-[2-(2-tert-Butoxycarbonylamino-3...)
Affinity DataIC50:  11nMpH: 6.0Assay Description:In vitro activity against human renin (pH 6.0)
In DepthDetails ArticlePubMed