BDBM50006190 2-[1-Benzyl-2-(4-methoxymethoxy-piperidin-1-yl)-2-oxo-ethoxy]-hexanoic acid [1-cyclohexylmethyl-2-hydroxy-5-methyl-4-(4-methyl-[1,4]diazepane-1-carbonyl)-hexyl]-amide::CHEMBL51935
SMILES CCCC[C@H](O[C@@H](Cc1ccccc1)C(=O)N1CCC(CC1)OCOC)C(=O)N[C@@H](CC1CCCCC1)[C@@H](O)C[C@@H](C(C)C)C(=O)N1CCCN(C)CC1
InChI Key InChIKey=RUGHFXHNZVGBJM-HECCNADXSA-N
Data  2 IC50
  Tab Delimited (TSV)   2D SDfile   Computed 3D by Vconf -m prep SDfile
Find this compound or compounds like it in BindingDB:
Activity Spreadsheet -- Enzyme Inhibition Constant Data from BindingDB
Found 2 hits for monomerid = 50006190
TargetRenin(Homo sapiens (Human))
Abbott Laboratories
Curated by ChEMBL
LigandPNGBDBM50006190(2-[1-Benzyl-2-(4-methoxymethoxy-piperidin-1-yl)-2-...)
Affinity DataIC50:  79nMpH: 7.4Assay Description:In vitro activity against human renin (pH 6.0)
In DepthDetails ArticlePubMed
TargetRenin(Homo sapiens (Human))
Abbott Laboratories
Curated by ChEMBL
LigandPNGBDBM50006190(2-[1-Benzyl-2-(4-methoxymethoxy-piperidin-1-yl)-2-...)
Affinity DataIC50:  17nMpH: 6.0Assay Description:In vitro activity against human renin (pH 6.0)
In DepthDetails ArticlePubMed