BDBM50006293 6-Carboxymethyl-12-(3-guanidino-propyl)-15-hydroxymethyl-1,5,8,11,14,17-hexaoxo-1lambda*4*-thia-4,7,10,13,16-pentaaza-cyclooctadecane-3-carboxylic acid::CHEMBL302682
SMILES NC(=N)NCCC[C@@H]1NC(=O)[C@H](CO)NC(=O)CS(=O)C[C@H](NC(=O)[C@H](CC(O)=O)NC(=O)CNC1=O)C(O)=O
InChI Key InChIKey=MQTBOXWGQFIMSZ-IGVFDEQQSA-N
Data  3 IC50
  Tab Delimited (TSV)   2D SDfile   Computed 3D by Vconf -m prep SDfile
Find this compound or compounds like it in BindingDB:
Activity Spreadsheet -- Enzyme Inhibition Constant Data from BindingDB
Found 3 hits for monomerid = 50006293
TargetIntegrin alpha-IIb/beta-3(Homo sapiens (Human))
Genentech
Curated by ChEMBL
LigandPNGBDBM50006293(6-Carboxymethyl-12-(3-guanidino-propyl)-15-hydroxy...)
Affinity DataIC50:  8nM. Assay description: The compound was tested for the inhibition of fibrinogen receptor
In DepthDetails ArticlePubMed
TargetIntegrin alpha-IIb/beta-3(Homo sapiens (Human))
Genentech
Curated by ChEMBL
LigandPNGBDBM50006293(6-Carboxymethyl-12-(3-guanidino-propyl)-15-hydroxy...)
Affinity DataIC50:  490nM. Assay description: Inhibition of ADP-induced platelet aggregation in human platelet-rich plasma
In DepthDetails ArticlePubMed
TargetIntegrin alpha-IIb/beta-3(Homo sapiens (Human))
Genentech
Curated by ChEMBL
LigandPNGBDBM50006293(6-Carboxymethyl-12-(3-guanidino-propyl)-15-hydroxy...)
Affinity DataIC50:  50nM. Assay description: Inhibition of Fibrinogen binding to Fibrinogen receptor
In DepthDetails ArticlePubMed