BDBM50006326 15-Benzyl-6-carboxymethyl-12-(3-guanidino-propyl)-5,8,11,14,17-pentaoxo-1-thia-4,7,10,13,16-pentaaza-cyclooctadecane-3-carboxylic acid::CHEMBL293845
SMILES NC(=N)NCCC[C@@H]1NC(=O)[C@@H](Cc2ccccc2)NC(=O)CSC[C@H](NC(=O)[C@H](CC(O)=O)NC(=O)CNC1=O)C(O)=O
InChI Key InChIKey=VSEAEAOBIZHMFV-MHORFTMASA-N
Data  2 IC50
  Tab Delimited (TSV)   2D SDfile   Computed 3D by Vconf -m prep SDfile
Find this compound or compounds like it in BindingDB:
Activity Spreadsheet -- Enzyme Inhibition Constant Data from BindingDB
Found 2 hits for monomerid = 50006326
TargetIntegrin alpha-IIb/beta-3(Homo sapiens (Human))
Genentech
Curated by ChEMBL
LigandPNGBDBM50006326(15-Benzyl-6-carboxymethyl-12-(3-guanidino-propyl)-...)
Affinity DataIC50:  35nM. Assay description: The compound was tested for the inhibition of fibrinogen receptor
In DepthDetails ArticlePubMed
TargetIntegrin alpha-IIb/beta-3(Homo sapiens (Human))
Genentech
Curated by ChEMBL
LigandPNGBDBM50006326(15-Benzyl-6-carboxymethyl-12-(3-guanidino-propyl)-...)
Affinity DataIC50:  1.85E+4nM. Assay description: Inhibition of ADP-induced platelet aggregation in human platelet-rich plasma
In DepthDetails ArticlePubMed