BDBM50006369 (4R)-6'-chloro-3'-methyl-1'H,2H,5H-spiro[imidazolidine-4,4'-quinazoline]-2,2',5(3'H)-trione::CHEMBL292723
SMILES CN1C(=O)Nc2ccc(Cl)cc2[C@@]11NC(=O)NC1=O
InChI Key InChIKey=QBRYBUXHTFUNRQ-LLVKDONJSA-N
Data  1 IC50
  Tab Delimited (TSV)   2D SDfile   Computed 3D by Vconf -m prep SDfile
Find this compound or compounds like it in BindingDB:
Activity Spreadsheet -- Enzyme Inhibition Constant Data from BindingDB
Found 1 hit for monomerid = 50006369
TargetAldo-keto reductase family 1 member B1(Homo sapiens (Human))
Tanabe Seiyaku
Curated by ChEMBL
LigandPNGBDBM50006369((4R)-6'-chloro-3'-methyl-1'H,2H,5H-spiro[imidazoli...)
Affinity DataIC50:  22nM. Assay description: Tested in vitro for inhibitory activity against partially purified aldose reductase from male rabbit lens
In DepthDetails ArticlePubMed