BDBM50006395 3'-ethyl-1'H,2H,5H-spiro[imidazolidine-4,4'-quinazoline]-2,2',5(3'H)-trione::CHEMBL63389
SMILES CCN1C(=O)Nc2ccccc2C11NC(=O)NC1=O
InChI Key InChIKey=QNBAJPGQVMHJRT-UHFFFAOYSA-N
Data  1 IC50
  Tab Delimited (TSV)   2D SDfile   Computed 3D by Vconf -m prep SDfile
Find this compound or compounds like it in BindingDB:
Activity Spreadsheet -- Enzyme Inhibition Constant Data from BindingDB
Found 1 hit for monomerid = 50006395
TargetAldo-keto reductase family 1 member B1(Homo sapiens (Human))
Tanabe Seiyaku
Curated by ChEMBL
LigandPNGBDBM50006395(3'-ethyl-1'H,2H,5H-spiro[imidazolidine-4,4'-quinaz...)
Affinity DataIC50:  1.00E+3nM. Assay description: Tested in vitro for inhibitory activity against partially purified aldose reductase from male rabbit lens
In DepthDetails ArticlePubMed