BDBM50006434 4-[2-(5-{3-[2-(2-tert-Butoxycarbonylamino-3-phenyl-propionylamino)-3-(1H-imidazol-4-yl)-propionylamino]-4-cyclohexyl-2-hydroxy-butylsulfanyl}-tetrazol-1-yl)-ethyl]-1-methyl-pyridinium; iodide::CHEMBL63190
SMILES C[n+]1ccc(CCn2nnnc2SC[C@H](O)[C@H](CC2CCCCC2)NC(=O)[C@H](Cc2cnc[nH]2)NC(=O)[C@H](Cc2ccccc2)NC(=O)OC(C)(C)C)cc1
InChI Key InChIKey=CHDQZJAFNHXVRX-CUPIEXAXSA-O
Data  1 IC50
  Tab Delimited (TSV)   2D SDfile   Computed 3D by Vconf -m prep SDfile
Find this compound or compounds like it in BindingDB:
Activity Spreadsheet -- Enzyme Inhibition Constant Data from BindingDB
Found 1 hit for monomerid = 50006434
TargetRenin(Homo sapiens (Human))
Merck Sharp & Dohme Research Laboratories
Curated by ChEMBL
LigandPNGBDBM50006434(4-[2-(5-{3-[2-(2-tert-Butoxycarbonylamino-3-phenyl...)
Affinity DataIC50:  678nM. Assay description: The compound was tested in vitro for inhibition of human plasma renin.
In DepthDetails ArticlePubMed