BDBM50006705 1,3,7-Trimethyl-8-[2-(3,4,5-trimethoxy-phenyl)-vinyl]-3,7-dihydro-purine-2,6-dione::CHEMBL27203
SMILES COc1cc(\C=C\c2nc3n(C)c(=O)n(C)c(=O)c3n2C)cc(OC)c1OC
InChI Key InChIKey=KIAYWZXEAJWSGJ-BQYQJAHWSA-N
Data  6 KI
  Tab Delimited (TSV)   2D SDfile   Computed 3D by Vconf -m prep SDfile
Find this compound or compounds like it in BindingDB:
Activity Spreadsheet -- Enzyme Inhibition Constant Data from BindingDB
Found 6 hits for monomerid = 50006705
TargetAdenosine receptor A2a/A2b(Rattus norvegicus)
Kyowa Hakko Kogyo
Curated by ChEMBL
LigandPNGBDBM50006705(1,3,7-Trimethyl-8-[2-(3,4,5-trimethoxy-phenyl)-vin...)
Affinity DataKi:  18nM. Assay description: Binding affinity at Adenosine A2 receptor from rat striatal membranes by N-[3H] ethyladenosin-5'- uronamide displacement.
In DepthDetails ArticlePubMed
TargetAdenosine receptor A2a/A2b(Rattus norvegicus)
Kyowa Hakko Kogyo
Curated by ChEMBL
LigandPNGBDBM50006705(1,3,7-Trimethyl-8-[2-(3,4,5-trimethoxy-phenyl)-vin...)
Affinity DataKi:  18nM. Assay description: Binding affinity against adenosine A2 receptor from rat striatal membranes, using N-[3H]-ethyladenosin-5''-uronamide as radioligand (in the presence ...
In DepthDetails ArticlePubMed
TargetAdenosine receptor A2a/A2b(Rattus norvegicus)
Kyowa Hakko Kogyo
Curated by ChEMBL
LigandPNGBDBM50006705(1,3,7-Trimethyl-8-[2-(3,4,5-trimethoxy-phenyl)-vin...)
Affinity DataKi:  131nM. Assay description: Binding affinity against adenosine A2 receptor in rat brain using [3H]- CGS 21680 as radioligand
In DepthDetails ArticlePubMed
TargetAdenosine receptor A1(Rattus norvegicus (rat))
National Institute Of Diabetes
Curated by ChEMBL
LigandPNGBDBM50006705(1,3,7-Trimethyl-8-[2-(3,4,5-trimethoxy-phenyl)-vin...)
Affinity DataKi: >9.20E+3nM. Assay description: Affinity against Adenosine A1 receptor in rat brain using [3H]- PIA as radioligand
In DepthDetails ArticlePubMed
TargetAdenosine receptor A1(GUINEA PIG)
Kyowa Hakko Kogyo
Curated by ChEMBL
LigandPNGBDBM50006705(1,3,7-Trimethyl-8-[2-(3,4,5-trimethoxy-phenyl)-vin...)
Affinity DataKi: >1.00E+5nM. Assay description: Binding affinity against adenosine A1 receptor from guinea pig forebrain membranes, using N6-[3H]-cyclohexyladenosine as radioligand.
In DepthDetails ArticlePubMed
TargetAdenosine receptor A1(GUINEA PIG)
Kyowa Hakko Kogyo
Curated by ChEMBL
LigandPNGBDBM50006705(1,3,7-Trimethyl-8-[2-(3,4,5-trimethoxy-phenyl)-vin...)
Affinity DataKi: >1.00E+5nM. Assay description: Binding affinity against Adenosine A1 receptor from guinea pig forebrain membranes by N6-[3H]- cyclohexyladenosine displacement.
In DepthDetails ArticlePubMed