BDBM50006848 CHEMBL88091::N-[2-(2-Amino-thiazol-4-yl)-1-(1-cyclohexylmethyl-2,3-dihydroxy-5-methyl-hexylcarbamoyl)-ethyl]-3-phenyl-2-(piperazine-1-sulfonylamino)-propionamide
SMILES CC(C)C[C@H](O)[C@H](O)[C@H](CC1CCCCC1)NC(=O)[C@H](Cc1csc(N)n1)NC(=O)[C@H](Cc1ccccc1)NS(=O)(=O)N1CCNCC1
InChI Key InChIKey=BZCJAFFUHZRXMP-VFFRCKCKSA-N
Data  2 IC50
  Tab Delimited (TSV)   2D SDfile   Computed 3D by Vconf -m prep SDfile
Find this compound or compounds like it in BindingDB:
Activity Spreadsheet -- Enzyme Inhibition Constant Data from BindingDB
Found 2 hits for monomerid = 50006848
TargetRenin(Homo sapiens (Human))
Parke-Davis Pharmaceutical Research Division Of Warner-Lambert
Curated by ChEMBL
LigandPNGBDBM50006848(CHEMBL88091 | N-[2-(2-Amino-thiazol-4-yl)-1-(1-cyc...)
Affinity DataIC50:  0.160nM. Assay description: In vitro inhibition of monkey renin.
In DepthDetails ArticlePubMed
TargetCathepsin D(Bos taurus)
Parke-Davis Pharmaceutical Research Division Of Warner-Lambert
Curated by ChEMBL
LigandPNGBDBM50006848(CHEMBL88091 | N-[2-(2-Amino-thiazol-4-yl)-1-(1-cyc...)
Affinity DataIC50:  8.90E+3nM. Assay description: Inhibition of Bovine Cathepsin D
In DepthDetails ArticlePubMed