BDBM50006867 (2-(1H-Indol-3-yl)-1-methyl-1-{2-phenyl-2-[3-(2,2,2-trifluoro-acetylamino)-propionylamino]-ethylcarbamoyl}-ethyl)-carbamic acid adamantan-2-yl ester::CHEMBL313559
SMILES CC(Cc1c[nH]c2ccccc12)(NC(=O)OC1C2CC3CC(C2)CC1C3)C(=O)NC[C@@H](NC(=O)CCNC(=O)C(F)(F)F)c1ccccc1
InChI Key InChIKey=WMOBXDNVCGRSLN-HVIBCVJASA-N
Data  2 IC50
  Tab Delimited (TSV)   2D SDfile   Computed 3D by Vconf -m prep SDfile
Find this compound or compounds like it in BindingDB:
Activity Spreadsheet -- Enzyme Inhibition Constant Data from BindingDB
Found 2 hits for monomerid = 50006867
TargetCholecystokinin receptor type A(RAT)
Parke-Davis Neuroscience Research Centre
Curated by ChEMBL
LigandPNGBDBM50006867((2-(1H-Indol-3-yl)-1-methyl-1-{2-phenyl-2-[3-(2,2,...)
Affinity DataIC50:  790nM. Assay description: Evaluated for inhibition of cholecystokinin type A receptor by displacing [125I]bolton hunter CCK-8 radioligand in the rat pancreas
In DepthDetails ArticlePubMed
TargetGastrin/cholecystokinin type B receptor(MOUSE)
Parke-Davis Neuroscience Research Centre
Curated by ChEMBL
LigandPNGBDBM50006867((2-(1H-Indol-3-yl)-1-methyl-1-{2-phenyl-2-[3-(2,2,...)
Affinity DataIC50:  110nM. Assay description: Evaluated for inhibition of cholecystokinin type B receptor by displacing [125I]-Bolton hunter CCK-8 radioligand in the mouse cerebral cortex
In DepthDetails ArticlePubMed