BDBM50007216 7-Methyl-1,3-dihydro-imidazo[4,5-b]quinolin-2-one::CHEMBL98738
SMILES Cc1ccc2nc3[nH]c(=O)[nH]c3cc2c1
InChI Key InChIKey=BSAKVJKPJIQKNP-UHFFFAOYSA-N
Data  2 IC50
  Tab Delimited (TSV)   2D SDfile   Computed 3D by Vconf -m prep SDfile
Find this compound or compounds like it in BindingDB:
Activity Spreadsheet -- Enzyme Inhibition Constant Data from BindingDB
Found 2 hits for monomerid = 50007216
TargetcGMP-inhibited 3',5'-cyclic phosphodiesterase 3A/3B(Homo sapiens (Human))
Bristol-Myers Squibb Pharmaceutical Research Institute
Curated by ChEMBL
LigandPNGBDBM50007216(7-Methyl-1,3-dihydro-imidazo[4,5-b]quinolin-2-one ...)
Affinity DataIC50:  50nM. Assay description: Inhibition of hydrolysis of c-AMP phosphodiesterase in human platelets
In DepthDetails ArticlePubMed
TargetcGMP-dependent 3',5'-cyclic phosphodiesterase(Homo sapiens (Human))
Bristol-Myers Squibb Pharmaceutical Research Institute
Curated by ChEMBL
LigandPNGBDBM50007216(7-Methyl-1,3-dihydro-imidazo[4,5-b]quinolin-2-one ...)
Affinity DataIC50: >1.00E+5nM. Assay description: Inhibition of cGMP hydrolysis by human platelet phosphodiesterase
In DepthDetails ArticlePubMed