BDBM50007281 CHEMBL2367819::Sodium; 7-[6-tert-butyl-4-(4-fluoro-phenyl)-2-isopropyl-pyridin-3-yl]-3,5-dihydroxy-hept-6-enoate
SMILES [Na+].CC(C)c1cc(-c2ccc(F)cc2)c(\C=C\[C@@H](O)C[C@@H](O)CC([O-])=O)c(n1)C(C)C
InChI Key InChIKey=QSBNHDKUOUVPNF-OSWQSNKQSA-M
Data  1 IC50
  Tab Delimited (TSV)   2D SDfile   Computed 3D by Vconf -m prep SDfile
Find this compound or compounds like it in BindingDB:
Activity Spreadsheet -- Enzyme Inhibition Constant Data from BindingDB
Found 1 hit for monomerid = 50007281
Target3-hydroxy-3-methylglutaryl-coenzyme A reductase(Rattus norvegicus (rat))
Hoechst
Curated by ChEMBL
LigandPNGBDBM50007281(CHEMBL2367819 | Sodium; 7-[6-tert-butyl-4-(4-fluor...)
Affinity DataIC50:  3nM. Assay description: In vitro inhibition of solubilized HMG-CoA reductase in rat liver.
In DepthDetails ArticlePubMed