BDBM50007298 CHEMBL101097::Sodium; 6-{2-[bis-(4-fluoro-3-methyl-phenyl)-methyl]-4,6-dichloro-phenoxy}-3,5-dihydroxy-hexanoate
SMILES Cc1cc(ccc1F)C(c1ccc(F)c(C)c1)c1cc(Cl)cc(Cl)c1OCC(O)C[C@@H](O)CC([O-])=O
InChI Key InChIKey=VRUKSNBTMNSBFT-FIWHBWSRSA-M
Data  1 IC50
  Tab Delimited (TSV)   2D SDfile   Computed 3D by Vconf -m prep SDfile
Find this compound or compounds like it in BindingDB:
Activity Spreadsheet -- Enzyme Inhibition Constant Data from BindingDB
Found 1 hit for monomerid = 50007298
Target3-hydroxy-3-methylglutaryl-coenzyme A reductase(Rattus norvegicus (rat))
Hoechst
Curated by ChEMBL
LigandPNGBDBM50007298(CHEMBL101097 | Sodium; 6-{2-[bis-(4-fluoro-3-methy...)
Affinity DataIC50:  1.00E+3nM. Assay description: In vitro inhibition of HMG-CoA reductase in solubilized rat liver.
In DepthDetails ArticlePubMed