BDBM50007322 2-(3,4-Dichloro-phenyl)-N-(2-pyrrolidin-1-yl-cyclohexyl)-acetamide::CHEMBL321329
SMILES Clc1ccc(CC(=O)N[C@@H]2CCCC[C@@H]2N2CCCC2)cc1Cl
InChI Key InChIKey=KWSRPMWFUYDWFC-SJORKVTESA-N
Data  1 KI
  Tab Delimited (TSV)   2D SDfile   Computed 3D by Vconf -m prep SDfile
Find this compound or compounds like it in BindingDB:
Activity Spreadsheet -- Enzyme Inhibition Constant Data from BindingDB
Found 1 hit for monomerid = 50007322
TargetSigma non-opioid intracellular receptor 1(Homo sapiens (Human))
National Institute Of Diabetes And Digestive And Kidney Diseases
Curated by ChEMBL
LigandPNGBDBM50007322(2-(3,4-Dichloro-phenyl)-N-(2-pyrrolidin-1-yl-cyclo...)
Affinity DataKi:  11nM. Assay description: Compound was tested for the inhibitory activity against Sigma opioid receptor by using [3H]-(+)-3-PPP as radioligand in guinea pig brain
In DepthDetails ArticlePubMed