BDBM50007559 5-[2-(4-Naphthalen-1-yl-piperazin-1-yl)-ethyl]-1,3-dihydro-indol-2-one::CHEMBL54786
SMILES O=C1Cc2cc(CCN3CCN(CC3)c3cccc4ccccc34)ccc2N1
InChI Key InChIKey=GEJKYGSJUJTWOZ-UHFFFAOYSA-N
Data  6 IC50
  Tab Delimited (TSV)   2D SDfile   Computed 3D by Vconf -m prep SDfile
Find this compound or compounds like it in BindingDB:
Activity Spreadsheet -- Enzyme Inhibition Constant Data from BindingDB
Found 6 hits for monomerid = 50007559
Target5-hydroxytryptamine receptor 1A(Rattus norvegicus (rat))
Pfizer
Curated by ChEMBL
LigandPNGBDBM50007559(5-[2-(4-Naphthalen-1-yl-piperazin-1-yl)-ethyl]-1,3...)
Affinity DataIC50:  4.87nM. Assay description: Binding affinity to 5-hydroxytryptamine 1A receptor in the rat brain using [3H]-8-hydroxy-2-(di-n-propylamine)tetralin as radioligand.
In DepthDetails ArticlePubMed
TargetD(2) dopamine receptor(Rattus norvegicus (rat))
Pfizer
Curated by ChEMBL
LigandPNGBDBM50007559(5-[2-(4-Naphthalen-1-yl-piperazin-1-yl)-ethyl]-1,3...)
Affinity DataIC50:  38nM. Assay description: Binding affinity to dopamine receptor D2 in the rat brain using [3H]-NPA as radioligand
In DepthDetails ArticlePubMed
TargetD(2) dopamine receptor(Homo sapiens (Human))
Organon Laboratories
Curated by ChEMBL
LigandPNGBDBM50007559(5-[2-(4-Naphthalen-1-yl-piperazin-1-yl)-ethyl]-1,3...)
Affinity DataIC50:  44nM. Assay description: Inhibition constant against dopamine receptor D2
In DepthDetails ArticlePubMed
Target5-hydroxytryptamine receptor 1A(Homo sapiens (Human))
Organon Laboratories
Curated by ChEMBL
LigandPNGBDBM50007559(5-[2-(4-Naphthalen-1-yl-piperazin-1-yl)-ethyl]-1,3...)
Affinity DataIC50:  5nM. Assay description: Inhibitory concentration against 5-hydroxytryptamine 1A receptor
In DepthDetails ArticlePubMed
Target5-hydroxytryptamine receptor 2A(Homo sapiens (Human))
Organon Laboratories
Curated by ChEMBL
LigandPNGBDBM50007559(5-[2-(4-Naphthalen-1-yl-piperazin-1-yl)-ethyl]-1,3...)
Affinity DataIC50:  20nM. Assay description: Inhibitory concentration against 5-hydroxytryptamine 2 receptor
In DepthDetails ArticlePubMed
TargetAlpha-1A/Alpha-1B/Alpha-1D adrenergic receptor(Homo sapiens (Human))
Organon Laboratories
Curated by ChEMBL
LigandPNGBDBM50007559(5-[2-(4-Naphthalen-1-yl-piperazin-1-yl)-ethyl]-1,3...)
Affinity DataIC50:  45nM. Assay description: Inhibitory concentration against alpha adrenergic receptor
In DepthDetails ArticlePubMed