BDBM50007563 1-Ethyl-5-[2-(4-naphthalen-1-yl-piperazin-1-yl)-ethyl]-1,3-dihydro-indol-2-one::CHEMBL56536
SMILES CCN1C(=O)Cc2cc(CCN3CCN(CC3)c3cccc4ccccc34)ccc12
InChI Key InChIKey=SZIFDVUATXWDDZ-UHFFFAOYSA-N
Data  2 IC50
  Tab Delimited (TSV)   2D SDfile   Computed 3D by Vconf -m prep SDfile
Find this compound or compounds like it in BindingDB:
Activity Spreadsheet -- Enzyme Inhibition Constant Data from BindingDB
Found 2 hits for monomerid = 50007563
TargetD(2) dopamine receptor(Rattus norvegicus (rat))
Pfizer
Curated by ChEMBL
LigandPNGBDBM50007563(1-Ethyl-5-[2-(4-naphthalen-1-yl-piperazin-1-yl)-et...)
Affinity DataIC50:  81.2nM. Assay description: Binding affinity to dopamine receptor D2 in the rat brain using [3H]-NPA as radioligand
In DepthDetails ArticlePubMed
Target5-hydroxytryptamine receptor 1A(Rattus norvegicus (rat))
Pfizer
Curated by ChEMBL
LigandPNGBDBM50007563(1-Ethyl-5-[2-(4-naphthalen-1-yl-piperazin-1-yl)-et...)
Affinity DataIC50:  2.90nM. Assay description: Binding affinity to 5-hydroxytryptamine 1A receptor in the rat brain using [3H]-8-hydroxy-2-(di-n-propylamine)tetralin as radioligand.
In DepthDetails ArticlePubMed