BDBM50007945 CHEMBL2369851::pGlu-His-Trp-Ser-Lys(atz)-DLys(atz)-Leu-ILys-Pro-DAla-NH2
SMILES CC(C)C[C@H](NC(=O)[C@@H](CCCCNc1n[nH]c(N)n1)NC(=O)[C@H](CCCCNc1n[nH]c(N)n1)NC(=O)[C@H](CO)NC(=O)[C@H](Cc1c[nH]c2ccccc12)NC(=O)[C@H](Cc1c[nH]cn1)NC(=O)[C@@H]1CCC(=O)N1)C(=O)N[C@@H](CCCCNC(C)C)C(=O)N1CCC[C@H]1C(=O)N[C@H](C)C(N)=O
InChI Key InChIKey=NRSAGIPLORJGIS-OUKFOJBUSA-N
Data  1 Kd
  Tab Delimited (TSV)   2D SDfile   Computed 3D by Vconf -m prep SDfile
Find this compound or compounds like it in BindingDB:
Activity Spreadsheet -- Enzyme Inhibition Constant Data from BindingDB
Found 1 hit for monomerid = 50007945
TargetGonadotropin-releasing hormone receptor(Rattus norvegicus)
Salk Institute
Curated by ChEMBL
LigandPNGBDBM50007945(CHEMBL2369851 | pGlu-His-Trp-Ser-Lys(atz)-DLys(atz...)
Affinity DataKd:  0.480nM. Assay description: In vitro binding affinity of Gonadotropin-releasing hormone antagonist was measured in rat pituitary cell membranes
In DepthDetails ArticlePubMed