BDBM500080 US11021457, Compound 87
SMILES O=C(Nc1cccc2C(=O)N(Cc12)C1CCC(=O)NC1=O)OCCOCCN1CCN(CCNC=C2C(=O)CC(CC2=O)c2ccccc2)CC1
InChI Key InChIKey=KYWYVQRQCMEPCP-NFFVHWSESA-N
Data  1 IC50
  Tab Delimited (TSV)   2D SDfile   Computed 3D by Vconf -m prep SDfile
Find this compound or compounds like it in BindingDB:
Activity Spreadsheet -- Enzyme Inhibition Constant Data from BindingDB
Found 1 hit for monomerid = 500080
TargetMicrotubule-associated proteins 1A/1B light chain 3B(Human)
Wigen Biomedicine Technology (Shanghai)
US Patent
LigandPNGBDBM500080(US11021457, Compound 87)
Affinity DataIC50:  275nM. Assay description: By constructing a prokaryotic expression system, the LC3B protein was successfully expressed and purified, and a preliminary screening and verificati...
Ligand InfoPC cidPC sid
In DepthDetails US Patent