BDBM50008052 3-Benzoyloxy-8-methyl-8-aza-bicyclo[3.2.1]octane-2-carboxylic acid 2-(4-azido-phenyl)-ethyl ester; hydrochloride::CHEMBL557204
SMILES CN1[C@@H]2CCC1C([C@H](C2)OC(=O)c1ccccc1)C(=O)OCCc1ccc(cc1)N=[N+]=[N-]
InChI Key InChIKey=OAYDMTVHPKDZQE-AEAFLJPSSA-N
Data  1 IC50
  Tab Delimited (TSV)   2D SDfile   Computed 3D by Vconf -m prep SDfile
Find this compound or compounds like it in BindingDB:
Activity Spreadsheet -- Enzyme Inhibition Constant Data from BindingDB
Found 1 hit for monomerid = 50008052
TargetSodium-dependent dopamine transporter(Rattus norvegicus (rat))
Research Triangle Institute
Curated by ChEMBL
LigandPNGBDBM50008052(3-Benzoyloxy-8-methyl-8-aza-bicyclo[3.2.1]octane-2...)
Affinity DataIC50:  227nM. Assay description: Inhibition of [3H]3-beta-(p-fluorophenyl)tropane-2beta-carboxylic acid methyl ester binding to Dopamine transporter in rat striatal membranes.
In DepthDetails ArticlePubMed