BDBM50008129 2-[2-(Morpholine-4-sulfonylamino)-3-phenyl-propionylamino]-pent-4-enoic acid [1-cyclohexylmethyl-3,3-difluoro-2-oxo-3-(2-pyridin-2-yl-ethylcarbamoyl)-propyl]-amide; Hydrate; CH3SO3H::CHEMBL281531
SMILES FC(F)(C(=O)NCCc1ccccn1)C(=O)[C@H](CC1CCCCC1)NC(=O)[C@H](CC=C)NC(=O)[C@H](Cc1ccccc1)NS(=O)(=O)N1CCOCC1
InChI Key InChIKey=BNJKPFMWJCPMKT-CHQNGUEUSA-N
Data  2 IC50
  Tab Delimited (TSV)   2D SDfile   Computed 3D by Vconf -m prep SDfile
Find this compound or compounds like it in BindingDB:
Activity Spreadsheet -- Enzyme Inhibition Constant Data from BindingDB
Found 2 hits for monomerid = 50008129
TargetCathepsin D(Bos taurus)
Warner-Lambert
Curated by ChEMBL
LigandPNGBDBM50008129(2-[2-(Morpholine-4-sulfonylamino)-3-phenyl-propion...)
Affinity DataIC50:  25nM. Assay description: Inhibitory activity against bovine Cathepsin D
In DepthDetails ArticlePubMed
TargetRenin(Homo sapiens (Human))
Warner-Lambert
Curated by ChEMBL
LigandPNGBDBM50008129(2-[2-(Morpholine-4-sulfonylamino)-3-phenyl-propion...)
Affinity DataIC50:  0.230nM. Assay description: The concentration producing 50% inhibition of renin activity in monkey plasma was determined by radioimmunoassay.
In DepthDetails ArticlePubMed