BDBM50008133 2-[2-(Morpholine-4-sulfonylamino)-3-phenyl-propionylamino]-hexanoic acid [1-cyclohexylmethyl-3,3-difluoro-3-(2-morpholin-4-yl-ethylcarbamoyl)-2-oxo-propyl]-amide::CHEMBL31956
SMILES CCCC[C@H](NC(=O)[C@H](Cc1ccccc1)NS(=O)(=O)N1CCOCC1)C(=O)N[C@@H](CC1CCCCC1)C(=O)C(F)(F)C(=O)NCCN1CCOCC1
InChI Key InChIKey=BTIJHFYMINAIMJ-CHQNGUEUSA-N
Data  2 IC50
  Tab Delimited (TSV)   2D SDfile   Computed 3D by Vconf -m prep SDfile
Find this compound or compounds like it in BindingDB:
Activity Spreadsheet -- Enzyme Inhibition Constant Data from BindingDB
Found 2 hits for monomerid = 50008133
TargetCathepsin D(Bos taurus)
Warner-Lambert
Curated by ChEMBL
LigandPNGBDBM50008133(2-[2-(Morpholine-4-sulfonylamino)-3-phenyl-propion...)
Affinity DataIC50:  36nM. Assay description: Inhibitory activity against bovine Cathepsin D
In DepthDetails ArticlePubMed
TargetRenin(Homo sapiens (Human))
Warner-Lambert
Curated by ChEMBL
LigandPNGBDBM50008133(2-[2-(Morpholine-4-sulfonylamino)-3-phenyl-propion...)
Affinity DataIC50:  0.350nM. Assay description: The concentration producing 50% inhibition of renin activity in monkey plasma was determined by radioimmunoassay.
In DepthDetails ArticlePubMed