BDBM50008178 4-(4,4-Dimethyl-pentylcarbamoyl)-4-[(quinoline-3-carbonyl)-amino]-butyric acid::CHEMBL124509
SMILES CC(C)(C)CCCNC(=O)C(CCC(O)=O)NC(=O)c1cnc2ccccc2c1
InChI Key InChIKey=RTXDHERSXBBNIA-UHFFFAOYSA-N
Data  2 IC50
  Tab Delimited (TSV)   2D SDfile   Computed 3D by Vconf -m prep SDfile
Find this compound or compounds like it in BindingDB:
Activity Spreadsheet -- Enzyme Inhibition Constant Data from BindingDB
Found 2 hits for monomerid = 50008178
TargetGastrin/cholecystokinin type B receptor(RAT)
Rotta Research Laboratorium
Curated by ChEMBL
LigandPNGBDBM50008178(4-(4,4-Dimethyl-pentylcarbamoyl)-4-[(quinoline-3-c...)
Affinity DataIC50:  1.60E+3nM. Assay description: Inhibition of the specific binding of [125I](BH)-CCK-8 to Cholecystokinin type B receptor in rat brain cortex
In DepthDetails ArticlePubMed
TargetCholecystokinin receptor type A(RAT)
Rotta Research Laboratorium
Curated by ChEMBL
LigandPNGBDBM50008178(4-(4,4-Dimethyl-pentylcarbamoyl)-4-[(quinoline-3-c...)
Affinity DataIC50:  300nM. Assay description: Concentration required to inhibit by 50% specific binding of [125I](BH)-CCK-8 to cholecystokinin type A receptor in rat pancreatic acini
In DepthDetails ArticlePubMed