BDBM50008193 4-Benzoylamino-4-pentylcarbamoyl-butyric acid::CHEMBL127551
SMILES CCCCCNC(=O)C(CCC(O)=O)NC(=O)c1ccccc1
InChI Key InChIKey=YMSBYINASRRCNJ-UHFFFAOYSA-N
Data  2 IC50
  Tab Delimited (TSV)   2D SDfile   Computed 3D by Vconf -m prep SDfile
Find this compound or compounds like it in BindingDB:
Activity Spreadsheet -- Enzyme Inhibition Constant Data from BindingDB
Found 2 hits for monomerid = 50008193
TargetGastrin/cholecystokinin type B receptor(RAT)
Rotta Research Laboratorium
Curated by ChEMBL
LigandPNGBDBM50008193(4-Benzoylamino-4-pentylcarbamoyl-butyric acid | CH...)
Affinity DataIC50:  9.60E+4nM. Assay description: Inhibition of the specific binding of [125I](BH)-CCK-8 to Cholecystokinin type B receptor in rat brain cortex
In DepthDetails ArticlePubMed
TargetCholecystokinin receptor type A(RAT)
Rotta Research Laboratorium
Curated by ChEMBL
LigandPNGBDBM50008193(4-Benzoylamino-4-pentylcarbamoyl-butyric acid | CH...)
Affinity DataIC50: >1.00E+5nM. Assay description: Inhibition of [125I](BH)-CCK-8 binding to cholecystokinin type A receptor in rat pancreatic acini; Inactive
In DepthDetails ArticlePubMed