BDBM50008245 2-Oct-1-ynyl-9H-purin-6-ylamine::CHEMBL315101
SMILES CCCCCCC#Cc1nc(N)c2[nH]cnc2n1
InChI Key InChIKey=ABCGZUNPGHUFFH-UHFFFAOYSA-N
Data  2 KI
  Tab Delimited (TSV)   2D SDfile   Computed 3D by Vconf -m prep SDfile
Find this compound or compounds like it in BindingDB:
Activity Spreadsheet -- Enzyme Inhibition Constant Data from BindingDB
Found 2 hits for monomerid = 50008245
TargetAdenosine receptor A2a/A2b(Rattus norvegicus)
Hokkaido University
Curated by ChEMBL
LigandPNGBDBM50008245(2-Oct-1-ynyl-9H-purin-6-ylamine | CHEMBL315101)
Affinity DataKi: >567nM. Assay description: Binding affinity against adenosine A2 receptor in rat striatal membranes using [3H]NECA as radioligand
In DepthDetails ArticlePubMed
TargetAdenosine receptor A1(Rattus norvegicus (rat))
Hokkaido University
Curated by ChEMBL
LigandPNGBDBM50008245(2-Oct-1-ynyl-9H-purin-6-ylamine | CHEMBL315101)
Affinity DataKi: >567nM. Assay description: Binding affinity against adenosine A1 receptor in rat brain membranes using [3H]CHA as radioligand
In DepthDetails ArticlePubMed