BDBM50008391 Bicyclo[2.2.1]hept-2-yl-(9-methyl-9H-purin-6-yl)-amine::CHEMBL337517
SMILES Cn1cnc2c(NC3CC4CCC3C4)ncnc12
InChI Key InChIKey=MTQYIGCUBBMQCJ-UHFFFAOYSA-N
Data  1 KI
  Tab Delimited (TSV)   2D SDfile   Computed 3D by Vconf -m prep SDfile
Find this compound or compounds like it in BindingDB:
Activity Spreadsheet -- Enzyme Inhibition Constant Data from BindingDB
Found 1 hit for monomerid = 50008391
TargetAdenosine receptor A1(BOVINE)
Niddk
Curated by ChEMBL
LigandPNGBDBM50008391(Bicyclo[2.2.1]hept-2-yl-(9-methyl-9H-purin-6-yl)-a...)
Affinity DataKi:  10nM. Assay description: Binding affinity for adenosine A1 receptor using [3H]- CHA or [3H]- PIA in bovine brain
In DepthDetails ArticlePubMed