BDBM50008459 CHEMBL142647::[3-(5-Nitro-benzo[b]thiophen-2-ylmethyl)-4-oxo-3,4-dihydro-phthalazin-1-yl]-acetic acid
SMILES OC(=O)Cc1nn(Cc2cc3cc(ccc3s2)[N+]([O-])=O)c(=O)c2ccccc12
InChI Key InChIKey=HOTVVNUMYVBTHN-UHFFFAOYSA-N
Data  1 IC50
  Tab Delimited (TSV)   2D SDfile   Computed 3D by Vconf -m prep SDfile
Find this compound or compounds like it in BindingDB:
Activity Spreadsheet -- Enzyme Inhibition Constant Data from BindingDB
Found 1 hit for monomerid = 50008459
TargetAldo-keto reductase family 1 member B1(Homo sapiens (Human))
Pfizer
Curated by ChEMBL
LigandPNGBDBM50008459(CHEMBL142647 | [3-(5-Nitro-benzo[b]thiophen-2-ylme...)
Affinity DataIC50:  2.20E+3nM. Assay description: In vitro inhibitory activity against aldose reductase isolated from human placenta
In DepthDetails ArticlePubMed