BDBM50008475 CHEMBL142599::{3-[(2-Bromo-5-trifluoromethyl-phenylcarbamoyl)-methyl]-4-oxo-3,4-dihydro-phthalazin-1-yl}-acetic acid
SMILES OC(=O)Cc1nn(CC(=O)Nc2cc(ccc2Br)C(F)(F)F)c(=O)c2ccccc12
InChI Key InChIKey=KOWJJEXQISLJRF-UHFFFAOYSA-N
Data  1 IC50
  Tab Delimited (TSV)   2D SDfile   Computed 3D by Vconf -m prep SDfile
Find this compound or compounds like it in BindingDB:
Activity Spreadsheet -- Enzyme Inhibition Constant Data from BindingDB
Found 1 hit for monomerid = 50008475
TargetAldo-keto reductase family 1 member B1(Homo sapiens (Human))
Pfizer
Curated by ChEMBL
LigandPNGBDBM50008475(CHEMBL142599 | {3-[(2-Bromo-5-trifluoromethyl-phen...)
Affinity DataIC50:  28nM. Assay description: In vitro inhibitory activity against aldose reductase isolated from human placenta
In DepthDetails ArticlePubMed