BDBM50008486 CHEMBL140199::[4-Oxo-3-(4-phenyl-thiazol-2-ylmethyl)-3,4-dihydro-phthalazin-1-yl]-acetic acid
SMILES OC(=O)Cc1nn(Cc2nc(cs2)-c2ccccc2)c(=O)c2ccccc12
InChI Key InChIKey=RRIWSZVDMOGZCC-UHFFFAOYSA-N
Data  1 IC50
  Tab Delimited (TSV)   2D SDfile   Computed 3D by Vconf -m prep SDfile
Find this compound or compounds like it in BindingDB:
Activity Spreadsheet -- Enzyme Inhibition Constant Data from BindingDB
Found 1 hit for monomerid = 50008486
TargetAldo-keto reductase family 1 member B1(Homo sapiens (Human))
Pfizer
Curated by ChEMBL
LigandPNGBDBM50008486(CHEMBL140199 | [4-Oxo-3-(4-phenyl-thiazol-2-ylmeth...)
Affinity DataIC50:  34nM. Assay description: In vitro inhibitory activity against aldose reductase isolated from human placenta
In DepthDetails ArticlePubMed