BDBM50008487 CHEMBL143708::{3-[(2-Bromo-3,5-bis-trifluoromethyl-phenylcarbamoyl)-methyl]-4-oxo-3,4-dihydro-phthalazin-1-yl}-acetic acid
SMILES OC(=O)Cc1nn(CC(=O)Nc2cc(cc(c2Br)C(F)(F)F)C(F)(F)F)c(=O)c2ccccc12
InChI Key InChIKey=TWZQVOWUSCAJDL-UHFFFAOYSA-N
Data  1 IC50
  Tab Delimited (TSV)   2D SDfile   Computed 3D by Vconf -m prep SDfile
Find this compound or compounds like it in BindingDB:
Activity Spreadsheet -- Enzyme Inhibition Constant Data from BindingDB
Found 1 hit for monomerid = 50008487
TargetAldo-keto reductase family 1 member B1(Homo sapiens (Human))
Pfizer
Curated by ChEMBL
LigandPNGBDBM50008487(CHEMBL143708 | {3-[(2-Bromo-3,5-bis-trifluoromethy...)
Affinity DataIC50:  2.20E+3nM. Assay description: In vitro inhibitory activity against aldose reductase isolated from human placenta
In DepthDetails ArticlePubMed