BDBM50008552 4-Methoxy-2-methyl-indan-1-one::CHEMBL422338
SMILES COc1cccc2C(=O)C(C)Cc12
InChI Key InChIKey=MWXYUIGGCLHWEP-UHFFFAOYSA-N
Data  2 IC50
  Tab Delimited (TSV)   2D SDfile   Computed 3D by Vconf -m prep SDfile
Find this compound or compounds like it in BindingDB:
Activity Spreadsheet -- Enzyme Inhibition Constant Data from BindingDB
Found 2 hits for monomerid = 50008552
TargetAcetylcholinesterase(Homo sapiens (Human))
University Of Illinois
Curated by ChEMBL
LigandPNGBDBM50008552(4-Methoxy-2-methyl-indan-1-one | CHEMBL422338)
Affinity DataIC50:  12nM. Assay description: Inhibition of acetylcholinesterase.
In DepthDetails ArticlePubMed
TargetAcetylcholinesterase(Homo sapiens (Human))
University Of Illinois
Curated by ChEMBL
LigandPNGBDBM50008552(4-Methoxy-2-methyl-indan-1-one | CHEMBL422338)
Affinity DataIC50:  380nM. Assay description: Inhibition of acetylcholinesterase.
In DepthDetails ArticlePubMed